MT7688 mkyaffs2image.c:470:6: error ...

mkyaffs2image.c:470:6: error: environment variable SOURCE_DATE_EPOCH must expand to a non-negative integer less than or equal to 253402300799
      fprintf(stderr,"mkyaffs2image: image building tool for YAFFS2 built "__DAT
      ^
mkyaffs2image.c: In function 'process_directory':
mkyaffs2image.c:369:8: warning: ignoring return value of 'readlink', declared with attribute warn_unused_result [-Wunused-result]
        readlink(full_name,symname,sizeof(symname) -1);
        ^
Makefile:43: recipe for target 'mkyaffs2image.o' failed
make[4]: *** [mkyaffs2image.o] Error 1
make[4]: Leaving directory '/work/mt7688/build_dir/host/yaffs2_android/yaffs2/utils'
Makefile:39: recipe for target '/work/mt7688/build_dir/host/yaffs2_android/.built' failed
make[3]: *** [/work/mt7688/build_dir/host/yaffs2_android/.built] Error 2
make[3]: Leaving directory '/work/mt7688/tools/yaffs2'
tools/Makefile:134: recipe for target 'tools/yaffs2/compile' failed
make[2]: *** [tools/yaffs2/compile] Error 2
make[2]: Leaving directory '/work/mt7688'
tools/Makefile:133: recipe for target '/work/mt7688/staging_dir/target-mipsel_24kec+dsp_musl-1.1.16/stamp/.tools_install_yynyynynynyyyyyyynyyynyyyyyyyyynyyyyynnyynynnyyynnnyy' failed
make[1]: *** [/work/mt7688/staging_dir/target-mipsel_24kec+dsp_musl-1.1.16/stamp/.tools_install_yynyynynynyyyyyyynyyynyyyyyyyyynyyyyynnyynynnyyynnnyy] Error 2
make[1]: Leaving directory '/work/mt7688'
/work/mt7688/include/toplevel.mk:192: recipe for target 'world' failed
已邀请:

xzmu - 10w

赞同来自:

sdk是在哪下载的?编译的系统是?

要回复问题请先登录注册